{"text_format":"1","workbook":"xlsx","n_sheets":4,"sheets":["Resumen","Valores Mensuales","Amortizacion","Graf"],"not_rendered":{"charts":1,"images":0,"macros":0,"external_links":0,"defined_names":2,"comments":2,"pivot_tables":0},"unopened":[],"bounds":{"document_bytes":16777216,"sheet_cells":100000,"rows_first":2000,"rows_last":500,"rows_between":2000,"halvings":0,"cell_chars":16384,"cell_head_chars":4096},"cells_cut":0,"cells_raw":0,"read":"whole","date_system":"1900"}

{"sheet":"Resumen","index":0,"n_rows":1026,"n_cols":44,"rows_kept":1026,"cut":false,"hidden":false,"merged":[[5,25,5,26],[5,39,5,40],[5,41,5,42],[5,37,5,38],[5,29,5,30],[5,31,5,32],[5,33,5,34],[5,35,5,36],[0,4,1,44],[5,27,5,28],[5,5,5,6],[5,7,5,8],[5,9,5,10],[5,11,5,12],[5,13,5,14],[5,15,5,16],[5,17,5,18],[5,19,5,20],[5,21,5,22],[5,23,5,24]]}
[null,null,null,null,"Nota: Los resultados que arroja este simulador son una proyección aproximada que no comprometen a ICETEX a mantener las condiciones de plazo, tasa o monto de la deuda, entre otras. No comprenden el Aporte de Invalidez y muerte- AFIM, costos de transacción ni cualquier otro costo que pueda generar el crédito. Tampoco implica la obligación para la entidad de otorgar efectivamente la operación simulada.  Los valores reales al momento de otorgar el crédito podrán ser modificados de conformidad con la variación de las tasas de interés."]
[]
[null,null,null,null,"meses",{"$f":"+(F8*6)-5","v":1},7,13,19,25,31,37,43,49,55,61,67,73,79,85,91,97,103,109,115,121,127,133,139,145,151,157,163,169,175,181,187,193,199,205,211,217,223,-5]
["Supuestos Generales"]
[]
["Línea de Crédito",null,"Posgrado País  40% con y sin DS",null,"Años",1,null,{"$f":"+F6+1","v":2},null,{"$f":"+H6+1","v":3},null,{"$f":"+J6+1","v":4},null,{"$f":"+L6+1","v":5},null,{"$f":"+N6+1","v":6},null,{"$f":"+P6+1","v":7},null,{"$f":"+R6+1","v":8},null,{"$f":"+T6+1","v":9},null,{"$f":"+V6+1","v":10},null,{"$f":"+X6+1","v":11},null,{"$f":"+Z6+1","v":12},null,{"$f":"+AB6+1","v":13},null,{"$f":"+AD6+1","v":14},null,{"$f":"+AF6+1","v":15},null,{"$f":"+AH6+1","v":16},null,{"$f":"+AJ6+1","v":17},null,{"$f":"+AL6+1","v":18},null,{"$f":"+AN6+1","v":19}]
[]
["Subsidio de Tasa",null,"NO",null,"Semestres",1,{"$f":"+F8+1","v":2},{"$f":"+G8+1","v":3},4,5,6,7,8,9,10,11,12,13,14,15,16,17,18,19,20,21,22,23,24,25,26,27,28,29,30,31,32,33,34,35,36,37,38]
[]
["Valor Semestre",null,5000000,null,"Estudio",1,{"$f":"+IF($C$14-F8>0,1,0)","v":0},{"$f":"+IF($C$14-G8>0,1,0)","v":0},0,0,0,0,0,0,0,0,0,0,0,0,0,0,0,0,0,0,0,0,0,0,0,0,0,0,0,0,0,0,0,{"$f":"+IF($C$14-AM8>0,1,0)","v":0},0,0,0,{"$f":"+SUM(F10:AQ10)","v":1}]
{"$rows_left_out":1017}
{"sheet":"Valores Mensuales","index":1,"n_rows":198,"n_cols":12,"rows_kept":198,"cut":false,"hidden":false,"merged":[[4,5,4,7],[1,0,1,8]]}
[]
["Nota: Los resultados que arroja este simulador son una proyección aproximada que no comprometen a ICETEX a mantener las condiciones de plazo, tasa o monto de la deuda, entre otras. No comprenden las primas de seguros, costos de transacción ni cualquier otro costo que pueda generar el crédito. Tampoco implica la obligación para la entidad de otorgar efectivamente la operación simulada.  Los valores reales al momento de otorgar el crédito podrán ser modificados de conformidad con la variación de las tasas de interés."]
[{"$f":"+\"Tabla de amortización simulación \"&Resumen!C6","v":"Tabla de amortización simulación Posgrado País  40% con y sin DS"},null,null,null,null,null,null,null,null,null,"pesos",1]
["Cifras en","pesos",null,null,null,null,null,null,null,null,"miles de $",1000]
[{"$f":"+VLOOKUP(B4,$K$3:$L$4,2,0)","v":1},null,null,null,null,"Flujo de Pago del Estudiante"]
["Mes","Pagos de Matrícula","Intereses causados en estudio","Intereses del crédito","Condonación 25%","Abono a Capital","Pago de intereses","Cuota"]
[1,{"$f":"-Amortizacion!Y2/$A$5","v":-5000000},{"$f":"-Amortizacion!H2/$A$5","v":-41713.4},{"$f":"(-Amortizacion!I2-Amortizacion!R2)/$A$5","v":-27808.935732251517},{"$f":"Amortizacion!O2/$A$5","v":0},{"$f":"(+Amortizacion!L2+Amortizacion!U2)/$A$5","v":321932.92388344457},{"$f":"Amortizacion!AA2/$A$5","v":27808.935732251517},{"$f":"+F7+G7","v":349741.85961569607}]
[2,{"$f":"-Amortizacion!Y3/$A$5","v":0},{"$f":"-Amortizacion!H3/$A$5","v":-41713.4},{"$f":"(-Amortizacion!I3-Amortizacion!R3)/$A$5","v":-23332.629737066251},{"$f":"Amortizacion!O3/$A$5","v":0},{"$f":"(+Amortizacion!L3+Amortizacion!U3)/$A$5","v":326409.22987862979},{"$f":"Amortizacion!AA3/$A$5","v":23332.629737066251},{"$f":"+F8+G8","v":349741.85961569601}]
[3,{"$f":"-Amortizacion!Y4/$A$5","v":0},{"$f":"-Amortizacion!H4/$A$5","v":-41713.4},{"$f":"(-Amortizacion!I4-Amortizacion!R4)/$A$5","v":-18794.083089011987},{"$f":"Amortizacion!O4/$A$5","v":0},{"$f":"(+Amortizacion!L4+Amortizacion!U4)/$A$5","v":330947.776526684},{"$f":"Amortizacion!AA4/$A$5","v":18794.083089011987},349741.85961569601]
[4,{"$f":"-Amortizacion!Y5/$A$5","v":0},{"$f":"-Amortizacion!H5/$A$5","v":-41713.4},{"$f":"(-Amortizacion!I5-Amortizacion!R5)/$A$5","v":-14192.430364930942},{"$f":"Amortizacion!O5/$A$5","v":0},{"$f":"(+Amortizacion!L5+Amortizacion!U5)/$A$5","v":335549.42925076518},{"$f":"Amortizacion!AA5/$A$5","v":14192.430364930942},349741.85961569613]
{"$rows_left_out":189}
{"sheet":"Amortizacion","index":2,"n_rows":234,"n_cols":28,"rows_kept":234,"cut":false,"hidden":true,"merged":[]}
["Mes","Mes","Giros programados","Periodo de Gracia","Paso al Cobro","Periodo Amortización","Saldo Inicial LP","Intereses Periodo de Estudios + Gra","Intereses Periodo amortización","Giro LP","Cuota LP","Abono a K LP","Pago i en periodo de estudio","Saldo Final LP","Condonación por graduación","Amortización CP","Saldo Inicial CP","Intereses CP","Giro CP","Cuota CP","Abono a K CP","Saldo Final CP","Saldo Total Final","Tasa","Flujo Desembolsos","Flujo Pagos Estudiante","Intereses pagados Estudiante","Subsidio de tasa"]
[1,1,{"$f":"+IFERROR(HLOOKUP($B2,Resumen!$F$3:$AM$10,8,0),0)","v":1},{"$f":"+IFERROR(HLOOKUP($B2,Resumen!$F$3:$AM$12,10),0)","v":0},{"$f":"+IF(B2=Resumen!$C$38*6-6,1,0)","v":0},{"$f":"+IFERROR(HLOOKUP($B2,Resumen!$F$3:$AM$14,12),0)","v":0},null,{"$f":"IF(X2=\"\",0,IF(F2=0,ROUND(SUM(J$2:J2)*X2,2),0))","v":41713.4},{"$f":"+IF(X2=\"\",0,IF(F2=1,G2*X2,0))","v":0},{"$f":"(Resumen!$C$10*(1-Resumen!$C$24))*C2","v":3000000},{"$f":"+IF(F2=1,PMT(X2,(Resumen!$C$36+Resumen!$C$26+Resumen!$C$14*6-B2+1),-Amortizacion!G2),0)","v":0},{"$f":"+IF(I2=\"\",\"\",K2-I2)","v":0},{"$f":"+IF(Resumen!$C$20=\"no\",H2,0)","v":0},{"$f":"+IF(F2=0,SUM(G2:K2)-M2,G2-L2)","v":3041713.4},{"$f":"+IF(AND(Resumen!$C$18=\"SI\",Amortizacion!E2=1),Amortizacion!N2*25%,0)","v":0},{"$f":"+IF(Resumen!$C$24=0%,0,IF(S2<>0,6,P1-1))","v":6},{"$f":"+S2","v":2000000},{"$f":"+IF(X2=\"\",0,Q2*X2)","v":27808.935732251517},{"$f":"(Resumen!$C$10*(Resumen!$C$24))*C2","v":2000000},{"$f":"+IF(X2=\"\",0,IFERROR(PMT(X2,P2,-Q2),0))","v":349741.85961569607},{"$f":"+IFERROR(T2-R2,0)","v":321932.92388344457},{"$f":"+Q2-U2","v":1678067.0761165554},{"$f":"+N2+V2","v":4719780.4761165548},{"$f":"+IF(B2=\"\",\"\",Resumen!$C$34)","v":1.3904467866125758E-2},{"$f":"+J2+S2","v":5000000},{"$f":"+T2+K2+M2","v":349741.85961569607},{"$f":"+R2+M2+I2","v":27808.935732251517},{"$f":"+IF(Resumen!$C$8=\"no\",0,W2*((1+10%)^(0.0833333333333333)-1))","v":0}]
[{"$f":"+A2+1","v":2},{"$f":"+IF(A3>Resumen!$C$40,\"\",A3)","v":2},{"$f":"+IFERROR(HLOOKUP($B3,Resumen!$F$3:$AM$10,8,0),0)","v":0},{"$f":"+IFERROR(HLOOKUP($B3,Resumen!$F$3:$AM$12,10),0)","v":0},{"$f":"+IF(B3=Resumen!$C$38*6-6,1,0)","v":0},{"$f":"+IFERROR(HLOOKUP($B3,Resumen!$F$3:$AM$14,12),0)","v":0},{"$f":"+N2","v":3041713.4},{"$f":"IF(X3=\"\",0,IF(F3=0,ROUND(SUM(J$2:J3)*X3,2),0))","v":41713.4},0,{"$f":"(Resumen!$C$10*(1-Resumen!$C$24))*C3","v":0},{"$f":"+IF(F3=1,PMT(X3,(Resumen!$C$36+Resumen!$C$26+Resumen!$C$14*6-B3+1),-Amortizacion!G3),0)","v":0},{"$f":"+IF(I3=\"\",\"\",K3-I3)","v":0},{"$f":"+IF(Resumen!$C$20=\"no\",H3,0)","v":0},{"$f":"+IF(F3=0,SUM(G3:K3)-M3,G3-L3)","v":3083426.8},{"$f":"+IF(AND(Resumen!$C$18=\"SI\",Amortizacion!E3=1),SUM($H$2:J3)*25%,0)","v":0},{"$f":"+IF(S3<>0,6,IF(P2=0,0,P2-1))","v":5},{"$f":"+V2+S3","v":1678067.0761165554},{"$f":"+IF(X3=\"\",0,Q3*X3)","v":23332.629737066251},{"$f":"(Resumen!$C$10*(Resumen!$C$24))*C3","v":0},{"$f":"+IF(X3=\"\",0,IFERROR(PMT(X3,P3,-Q3),0))","v":349741.85961569601},{"$f":"+IFERROR(T3-R3,0)","v":326409.22987862979},{"$f":"+Q3-U3","v":1351657.8462379256},{"$f":"+N3+V3","v":4435084.6462379256},{"$f":"+IF(B3=\"\",\"\",Resumen!$C$34)","v":1.3904467866125758E-2},0,{"$f":"+T3+K3+M3","v":349741.85961569601},{"$f":"+R3+M3+I3","v":23332.629737066251},{"$f":"+IF(Resumen!$C$8=\"no\",0,W3*((1+10%)^(0.0833333333333333)-1))","v":0}]
[{"$f":"+A3+1","v":3},{"$f":"+IF(A4>Resumen!$C$40,\"\",A4)","v":3},{"$f":"+IFERROR(HLOOKUP($B4,Resumen!$F$3:$AM$10,8,0),0)","v":0},{"$f":"+IFERROR(HLOOKUP($B4,Resumen!$F$3:$AM$12,10),0)","v":0},{"$f":"+IF(B4=Resumen!$C$38*6-6,1,0)","v":0},{"$f":"+IFERROR(HLOOKUP($B4,Resumen!$F$3:$AM$14,12),0)","v":0},3083426.8,{"$f":"IF(X4=\"\",0,IF(F4=0,ROUND(SUM(J$2:J4)*X4,2),0))","v":41713.4},0,{"$f":"(Resumen!$C$10*(1-Resumen!$C$24))*C4","v":0},{"$f":"+IF(F4=1,PMT(X4,(Resumen!$C$36+Resumen!$C$26+Resumen!$C$14*6-B4+1),-Amortizacion!G4),0)","v":0},0,{"$f":"+IF(Resumen!$C$20=\"no\",H4,0)","v":0},3125140.1999999997,{"$f":"+IF(AND(Resumen!$C$18=\"SI\",Amortizacion!E4=1),SUM($H$2:J4)*25%,0)","v":0},{"$f":"+IF(S4<>0,6,IF(P3=0,0,P3-1))","v":4},{"$f":"+V3+S4","v":1351657.8462379256},18794.083089011987,{"$f":"(Resumen!$C$10*(Resumen!$C$24))*C4","v":0},349741.85961569601,330947.776526684,1020710.0697112416,{"$f":"+N4+V4","v":4145850.2697112411},{"$f":"+IF(B4=\"\",\"\",Resumen!$C$34)","v":1.3904467866125758E-2},0,349741.85961569601,18794.083089011987,{"$f":"+IF(Resumen!$C$8=\"no\",0,W4*((1+10%)^(0.0833333333333333)-1))","v":0}]
[4,{"$f":"+IF(A5>Resumen!$C$40,\"\",A5)","v":4},{"$f":"+IFERROR(HLOOKUP($B5,Resumen!$F$3:$AM$10,8,0),0)","v":0},{"$f":"+IFERROR(HLOOKUP($B5,Resumen!$F$3:$AM$12,10),0)","v":0},{"$f":"+IF(B5=Resumen!$C$38*6-6,1,0)","v":0},{"$f":"+IFERROR(HLOOKUP($B5,Resumen!$F$3:$AM$14,12),0)","v":0},3125140.1999999997,{"$f":"IF(X5=\"\",0,IF(F5=0,ROUND(SUM(J$2:J5)*X5,2),0))","v":41713.4},0,{"$f":"(Resumen!$C$10*(1-Resumen!$C$24))*C5","v":0},{"$f":"+IF(F5=1,PMT(X5,(Resumen!$C$36+Resumen!$C$26+Resumen!$C$14*6-B5+1),-Amortizacion!G5),0)","v":0},0,{"$f":"+IF(Resumen!$C$20=\"no\",H5,0)","v":0},3166853.5999999996,{"$f":"+IF(AND(Resumen!$C$18=\"SI\",Amortizacion!E5=1),SUM($H$2:J5)*25%,0)","v":0},3,1020710.0697112416,14192.430364930942,{"$f":"(Resumen!$C$10*(Resumen!$C$24))*C5","v":0},349741.85961569613,335549.42925076518,685160.64046047651,3852014.2404604759,{"$f":"+IF(B5=\"\",\"\",Resumen!$C$34)","v":1.3904467866125758E-2},0,349741.85961569613,14192.430364930942,{"$f":"+IF(Resumen!$C$8=\"no\",0,W5*((1+10%)^(0.0833333333333333)-1))","v":0}]
[5,{"$f":"+IF(A6>Resumen!$C$40,\"\",A6)","v":5},{"$f":"+IFERROR(HLOOKUP($B6,Resumen!$F$3:$AM$10,8,0),0)","v":0},{"$f":"+IFERROR(HLOOKUP($B6,Resumen!$F$3:$AM$12,10),0)","v":0},{"$f":"+IF(B6=Resumen!$C$38*6-6,1,0)","v":0},{"$f":"+IFERROR(HLOOKUP($B6,Resumen!$F$3:$AM$14,12),0)","v":0},3166853.5999999996,{"$f":"IF(X6=\"\",0,IF(F6=0,ROUND(SUM(J$2:J6)*X6,2),0))","v":41713.4},0,{"$f":"(Resumen!$C$10*(1-Resumen!$C$24))*C6","v":0},{"$f":"+IF(F6=1,PMT(X6,(Resumen!$C$36+Resumen!$C$26+Resumen!$C$14*6-B6+1),-Amortizacion!G6),0)","v":0},0,{"$f":"+IF(Resumen!$C$20=\"no\",H6,0)","v":0},3208566.9999999995,{"$f":"+IF(AND(Resumen!$C$18=\"SI\",Amortizacion!E6=1),SUM($H$2:J6)*25%,0)","v":0},2,685160.64046047651,9526.7941084168397,{"$f":"(Resumen!$C$10*(Resumen!$C$24))*C6","v":0},349741.85961569619,340215.06550727936,344945.57495319715,3553512.5749531966,{"$f":"+IF(B6=\"\",\"\",Resumen!$C$34)","v":1.3904467866125758E-2},0,349741.85961569619,9526.7941084168397,{"$f":"+IF(Resumen!$C$8=\"no\",0,W6*((1+10%)^(0.0833333333333333)-1))","v":0}]
[6,{"$f":"+IF(A7>Resumen!$C$40,\"\",A7)","v":6},{"$f":"+IFERROR(HLOOKUP($B7,Resumen!$F$3:$AM$10,8,0),0)","v":0},{"$f":"+IFERROR(HLOOKUP($B7,Resumen!$F$3:$AM$12,10),0)","v":0},{"$f":"+IF(B7=Resumen!$C$38*6-6,1,0)","v":1},{"$f":"+IFERROR(HLOOKUP($B7,Resumen!$F$3:$AM$14,12),0)","v":0},3208566.9999999995,{"$f":"IF(X7=\"\",0,IF(F7=0,ROUND(SUM(J$2:J7)*X7,2),0))","v":41713.4},0,{"$f":"(Resumen!$C$10*(1-Resumen!$C$24))*C7","v":0},{"$f":"+IF(F7=1,PMT(X7,(Resumen!$C$36+Resumen!$C$26+Resumen!$C$14*6-B7+1),-Amortizacion!G7),0)","v":0},0,{"$f":"+IF(Resumen!$C$20=\"no\",H7,0)","v":0},3250280.3999999994,{"$f":"+IF(AND(Resumen!$C$18=\"SI\",Amortizacion!E7=1),SUM($H$2:J7)*25%,0)","v":0},1,344945.57495319715,4796.2846624990043,{"$f":"(Resumen!$C$10*(Resumen!$C$24))*C7","v":0},349741.85961569613,344945.57495319715,0,3250280.3999999994,{"$f":"+IF(B7=\"\",\"\",Resumen!$C$34)","v":1.3904467866125758E-2},0,349741.85961569613,4796.2846624990043,{"$f":"+IF(Resumen!$C$8=\"no\",0,W7*((1+10%)^(0.0833333333333333)-1))","v":0}]
[7,{"$f":"+IF(A8>Resumen!$C$40,\"\",A8)","v":7},{"$f":"+IFERROR(HLOOKUP($B8,Resumen!$F$3:$AM$10,8,0),0)","v":0},{"$f":"+IFERROR(HLOOKUP($B8,Resumen!$F$3:$AM$12,10),0)","v":0},{"$f":"+IF(B8=Resumen!$C$38*6-6,1,0)","v":0},{"$f":"+IFERROR(HLOOKUP($B8,Resumen!$F$3:$AM$14,12),0)","v":1},3250280.3999999994,{"$f":"IF(X8=\"\",0,IF(F8=0,ROUND(SUM(J$2:J8)*X8,2),0))","v":0},45193.419377698367,{"$f":"(Resumen!$C$10*(1-Resumen!$C$24))*C8","v":0},{"$f":"+IF(F8=1,PMT(X8,(Resumen!$C$36+Resumen!$C$26+Resumen!$C$14*6-B8+1),-Amortizacion!G8),0)","v":295955.91148584179},250762.49210814343,{"$f":"+IF(Resumen!$C$20=\"no\",H8,0)","v":0},2999517.907891856,{"$f":"+IF(AND(Resumen!$C$18=\"SI\",Amortizacion!E8=1),SUM($H$2:J8)*25%,0)","v":0},0,0,0,{"$f":"(Resumen!$C$10*(Resumen!$C$24))*C8","v":0},0,0,0,2999517.907891856,{"$f":"+IF(B8=\"\",\"\",Resumen!$C$34)","v":1.3904467866125758E-2},0,295955.91148584179,45193.419377698367,{"$f":"+IF(Resumen!$C$8=\"no\",0,W8*((1+10%)^(0.0833333333333333)-1))","v":0}]
[8,{"$f":"+IF(A9>Resumen!$C$40,\"\",A9)","v":8},{"$f":"+IFERROR(HLOOKUP($B9,Resumen!$F$3:$AM$10,8,0),0)","v":0},{"$f":"+IFERROR(HLOOKUP($B9,Resumen!$F$3:$AM$12,10),0)","v":0},{"$f":"+IF(B9=Resumen!$C$38*6-6,1,0)","v":0},{"$f":"+IFERROR(HLOOKUP($B9,Resumen!$F$3:$AM$14,12),0)","v":1},{"$f":"+N8-O8","v":2999517.907891856},{"$f":"IF(X9=\"\",0,IF(F9=0,ROUND(SUM(J$2:J9)*X9,2),0))","v":0},41706.700364151075,{"$f":"(Resumen!$C$10*(1-Resumen!$C$24))*C9","v":0},{"$f":"+IF(F9=1,PMT(X9,(Resumen!$C$36+Resumen!$C$26+Resumen!$C$14*6-B9+1),-Amortizacion!G9),0)","v":295955.91148584179},254249.21112169072,{"$f":"+IF(Resumen!$C$20=\"no\",H9,0)","v":0},2745268.6967701651,{"$f":"+IF(AND(Resumen!$C$18=\"SI\",Amortizacion!E9=1),SUM($H$2:J9)*25%,0)","v":0},0,0,0,{"$f":"(Resumen!$C$10*(Resumen!$C$24))*C9","v":0},0,0,0,2745268.6967701651,{"$f":"+IF(B9=\"\",\"\",Resumen!$C$34)","v":1.3904467866125758E-2},0,295955.91148584179,41706.700364151075,{"$f":"+IF(Resumen!$C$8=\"no\",0,W9*((1+10%)^(0.0833333333333333)-1))","v":0}]
[9,{"$f":"+IF(A10>Resumen!$C$40,\"\",A10)","v":9},{"$f":"+IFERROR(HLOOKUP($B10,Resumen!$F$3:$AM$10,8,0),0)","v":0},{"$f":"+IFERROR(HLOOKUP($B10,Resumen!$F$3:$AM$12,10),0)","v":0},{"$f":"+IF(B10=Resumen!$C$38*6-6,1,0)","v":0},{"$f":"+IFERROR(HLOOKUP($B10,Resumen!$F$3:$AM$14,12),0)","v":1},{"$f":"+N9-O9","v":2745268.6967701651},{"$f":"IF(X10=\"\",0,IF(F10=0,ROUND(SUM(J$2:J10)*X10,2),0))","v":0},38171.500378121702,{"$f":"(Resumen!$C$10*(1-Resumen!$C$24))*C10","v":0},{"$f":"+IF(F10=1,PMT(X10,(Resumen!$C$36+Resumen!$C$26+Resumen!$C$14*6-B10+1),-Amortizacion!G10),0)","v":295955.91148584179},257784.41110772008,{"$f":"+IF(Resumen!$C$20=\"no\",H10,0)","v":0},2487484.2856624452,{"$f":"+IF(AND(Resumen!$C$18=\"SI\",Amortizacion!E10=1),SUM($H$2:J10)*25%,0)","v":0},0,0,0,{"$f":"(Resumen!$C$10*(Resumen!$C$24))*C10","v":0},0,0,0,2487484.2856624452,{"$f":"+IF(B10=\"\",\"\",Resumen!$C$34)","v":1.3904467866125758E-2},0,295955.91148584179,38171.500378121702,{"$f":"+IF(Resumen!$C$8=\"no\",0,W10*((1+10%)^(0.0833333333333333)-1))","v":0}]
{"$rows_left_out":225}
{"sheet":"Graf","index":3,"n_rows":43,"n_cols":8,"rows_kept":43,"cut":false,"hidden":true,"merged":[]}
[]
["Semestre","Pagos de Matrícula","Intereses causados","Intereses del crédito","Condonación 25%","Abono a Capital","Pago de intereses","Subsidio a la tasa"]
[1,{"$f":"+SUM(Amortizacion!Y2:Y7)","v":5000000},{"$f":"+SUM(Amortizacion!H2:H7)","v":250280.4},{"$f":"+SUM(Amortizacion!I2:I7)+SUM(Amortizacion!R2:R7)","v":98451.157694176538},{"$f":"-SUM(Amortizacion!O2:O7)","v":0},{"$f":"-SUM(Amortizacion!L2:L7)-SUM(Amortizacion!U2:U7)","v":-2000000},{"$f":"-SUM(Amortizacion!AA2:AA7)","v":-98451.157694176538},{"$f":"+SUM(Amortizacion!AB2:AB7)","v":0}]
[2,{"$f":"+SUM(Amortizacion!Y8:Y13)","v":0},{"$f":"+SUM(Amortizacion!H8:H13)","v":0},{"$f":"+SUM(Amortizacion!I8:I13)+SUM(Amortizacion!R8:R13)","v":217879.94371296433},{"$f":"-SUM(Amortizacion!O8:O13)","v":0},{"$f":"-SUM(Amortizacion!L8:L13)-SUM(Amortizacion!U8:U13)","v":-1557855.5252020862},{"$f":"-SUM(Amortizacion!AA8:AA13)","v":-217879.94371296433},{"$f":"+SUM(Amortizacion!AB8:AB13)","v":0}]
[3,{"$f":"+SUM(Amortizacion!Y14:Y19)","v":0},{"$f":"+SUM(Amortizacion!H14:H19)","v":0},{"$f":"+SUM(Amortizacion!I14:I19)+SUM(Amortizacion!R14:R19)","v":83310.594117138186},{"$f":"-SUM(Amortizacion!O14:O19)","v":0},{"$f":"-SUM(Amortizacion!L14:L19)-SUM(Amortizacion!U14:U19)","v":-1692424.8747979135},{"$f":"-SUM(Amortizacion!AA14:AA19)","v":-83310.594117138186},{"$f":"+SUM(Amortizacion!AB14:AB19)","v":0}]
[4,{"$f":"+SUM(Amortizacion!Y20:Y25)","v":0},{"$f":"+SUM(Amortizacion!H20:H25)","v":0},{"$f":"+SUM(Amortizacion!I20:I25)+SUM(Amortizacion!R20:R25)","v":0},{"$f":"-SUM(Amortizacion!O20:O25)","v":0},{"$f":"-SUM(Amortizacion!L20:L25)-SUM(Amortizacion!U20:U25)","v":0},{"$f":"-SUM(Amortizacion!AA20:AA25)","v":0},{"$f":"+SUM(Amortizacion!AB20:AB25)","v":0}]
[5,{"$f":"+SUM(Amortizacion!Y26:Y31)","v":0},{"$f":"+SUM(Amortizacion!H26:H31)","v":0},{"$f":"+SUM(Amortizacion!I26:I31)+SUM(Amortizacion!R26:R31)","v":0},{"$f":"-SUM(Amortizacion!O26:O31)","v":0},{"$f":"-SUM(Amortizacion!L26:L31)-SUM(Amortizacion!U26:U31)","v":0},{"$f":"-SUM(Amortizacion!AA26:AA31)","v":0},{"$f":"+SUM(Amortizacion!AB26:AB31)","v":0}]
[6,{"$f":"+SUM(Amortizacion!Y32:Y37)","v":0},{"$f":"+SUM(Amortizacion!H32:H37)","v":0},{"$f":"+SUM(Amortizacion!I32:I37)+SUM(Amortizacion!R32:R37)","v":0},{"$f":"-SUM(Amortizacion!O32:O37)","v":0},{"$f":"-SUM(Amortizacion!L32:L37)-SUM(Amortizacion!U32:U37)","v":0},{"$f":"-SUM(Amortizacion!AA32:AA37)","v":0},{"$f":"+SUM(Amortizacion!AB32:AB37)","v":0}]
[7,{"$f":"+SUM(Amortizacion!Y38:Y43)","v":0},{"$f":"+SUM(Amortizacion!H38:H43)","v":0},{"$f":"+SUM(Amortizacion!I38:I43)+SUM(Amortizacion!R38:R43)","v":0},{"$f":"-SUM(Amortizacion!O38:O43)","v":0},{"$f":"-SUM(Amortizacion!L38:L43)-SUM(Amortizacion!U38:U43)","v":0},{"$f":"-SUM(Amortizacion!AA38:AA43)","v":0},{"$f":"+SUM(Amortizacion!AB38:AB43)","v":0}]
[8,{"$f":"+SUM(Amortizacion!Y44:Y49)","v":0},{"$f":"+SUM(Amortizacion!H44:H49)","v":0},{"$f":"+SUM(Amortizacion!I44:I49)+SUM(Amortizacion!R44:R49)","v":0},{"$f":"-SUM(Amortizacion!O44:O49)","v":0},{"$f":"-SUM(Amortizacion!L44:L49)-SUM(Amortizacion!U44:U49)","v":0},{"$f":"-SUM(Amortizacion!AA44:AA49)","v":0},{"$f":"+SUM(Amortizacion!AB44:AB49)","v":0}]
{"$rows_left_out":33}